Reaction Details
TargetGlucagon receptor
LigandBDBM50120322
Substrate/Competitorn/a
Meas. Tech.ChEMBL_1518284 (CHEMBL3620259)
IC50 3.0±n/a nM
Citation Lin, SZhang, FJiang, GQureshi, SAYang, XChicchi, GGTota, LBansal, ABrady, ETrujillo, MSalituro, GMiller, CTata, JRZhang, BBParmee, ER A novel series of indazole-/indole-based glucagon receptor antagonists. Bioorg Med Chem Lett25:4143-7 (2015) 
 
Glucagon receptor
Name:Glucagon receptor
Type:Enzyme
Mol. Mass.:54026.92
Organism:Homo sapiens (Human)
Description:P47871
Residue:477
BDBM50120322
NameBDBM50120322
Synonyms:CHEMBL3616591
TypeSmall organic molecule
Emp. Form.C33H27ClF3N3O5
Mol. Mass.638.033
SMILESCOc1ccc(Cl)cc1-c1nn(C(C)c2ccc(cc2)C(=O)NCCC(O)=O)c2cc(ccc12)-c1ccc(OC(F)(F)F)cc1