Reaction Details
TargetGlucagon receptor
LigandBDBM50120327
Substrate/Competitorn/a
Meas. Tech.ChEMBL_1518284 (CHEMBL3620259)
IC50 2.0±n/a nM
Citation Lin, SZhang, FJiang, GQureshi, SAYang, XChicchi, GGTota, LBansal, ABrady, ETrujillo, MSalituro, GMiller, CTata, JRZhang, BBParmee, ER A novel series of indazole-/indole-based glucagon receptor antagonists. Bioorg Med Chem Lett25:4143-7 (2015) 
 
Glucagon receptor
Name:Glucagon receptor
Type:Enzyme
Mol. Mass.:54026.92
Organism:Homo sapiens (Human)
Description:P47871
Residue:477
BDBM50120327
NameBDBM50120327
Synonyms:CHEMBL3616675
TypeSmall organic molecule
Emp. Form.C33H26ClF3N4O5
Mol. Mass.651.032
SMILESCC(c1ccc(cc1)C(=O)NCCC(O)=O)n1nc(-c2cc(Cl)ccc2C(N)=O)c2ccc(cc12)-c1ccc(OC(F)(F)F)cc1