Reaction Details
TargetSphingosine 1-phosphate receptor 2
LigandBDBM50120514
Substrate/Competitorn/a
Meas. Tech.ChEMBL_1518043 (CHEMBL3619044)
IC50 2800±n/a nM
Citation Kusumi, KShinozaki, KYamaura, YHashimoto, AKurata, HNaganawa, AUeda, HOtsuki, KMatsushita, TSekiguchi, TKakuuchi, ASeko, T Discovery of novel S1P2 antagonists. Part 2: Improving the profile of a series of 1,3-bis(aryloxy)benzene derivatives. Bioorg Med Chem Lett25:4387-92 (2015) 
 
Sphingosine 1-phosphate receptor 2
Name:Sphingosine 1-phosphate receptor 2
Type:G Protein-Coupled Receptor (GPCR)
Mol. Mass.:38883.16
Organism:Homo sapiens (Human)
Description:Membranes isolated from S1P2-transfected CHO cells were used in ligand binding assay.
Residue:353
BDBM50120514
NameBDBM50120514
Synonyms:CHEMBL3618190
TypeSmall organic molecule
Emp. Form.C19H17BrF4N2O2
Mol. Mass.461.248
SMILESOC1(CCN(CC1)C(=O)Nc1cc(F)cc(c1)C(F)(F)F)c1ccc(Br)cc1