Reaction Details
TargetSphingosine 1-phosphate receptor 4
LigandBDBM149705
Substrate/Competitorn/a
Meas. Tech.ChEMBL_1518055 (CHEMBL3619056)
IC50>10000±n/a nM
Citation Kusumi, KShinozaki, KYamaura, YHashimoto, AKurata, HNaganawa, AUeda, HOtsuki, KMatsushita, TSekiguchi, TKakuuchi, ASeko, T Discovery of novel S1P2 antagonists. Part 2: Improving the profile of a series of 1,3-bis(aryloxy)benzene derivatives. Bioorg Med Chem Lett25:4387-92 (2015) 
 
Sphingosine 1-phosphate receptor 4
Name:Sphingosine 1-phosphate receptor 4
Type:G Protein-Coupled Receptor (GPCR)
Mol. Mass.:41647.39
Organism:Homo sapiens (Human)
Description:n/a
Residue:384
BDBM149705
NameBDBM149705
Synonyms:US8975409, Example 9(3)
TypeSmall organic molecule
Emp. Form.C31H26F2N2O6
Mol. Mass.560.5447
SMILESOC(=O)c1ccc(Oc2cc(NC(=O)N3CCC(O)(CC3)c3ccc(F)cc3)cc(Oc3ccc(F)cc3)c2)cc1