Reaction Details
TargetSphingosine 1-phosphate receptor 2
LigandBDBM50065611
Substrate/Competitorn/a
Meas. Tech.ChEMBL_1518045 (CHEMBL3619046)
IC50 4.8±n/a nM
Citation Kusumi, KShinozaki, KYamaura, YHashimoto, AKurata, HNaganawa, AUeda, HOtsuki, KMatsushita, TSekiguchi, TKakuuchi, ASeko, T Discovery of novel S1P2 antagonists. Part 2: Improving the profile of a series of 1,3-bis(aryloxy)benzene derivatives. Bioorg Med Chem Lett25:4387-92 (2015) 
 
Sphingosine 1-phosphate receptor 2
Name:Sphingosine 1-phosphate receptor 2
Type:Protein
Mol. Mass.:38749.58
Organism:Rattus norvegicus (Rat)
Description:P47752
Residue:352
BDBM50065611
NameBDBM50065611
Synonyms:CHEMBL3401383
TypeSmall organic molecule
Emp. Form.C31H36FN3O5
Mol. Mass.549.633
SMILESCCC(CC)CC1(O)CCN(CC1)C(=O)Nc1cc(Oc2ccc(F)cc2)cc(Oc2ccc(cc2)C(N)=O)c1