Reaction Details
TargetDelta-type opioid receptor
LigandBDBM50121680
Substrate/Competitorn/a
Meas. Tech.ChEMBL_1516517 (CHEMBL3619868)
Ki 0.200000±n/a nM
Citation Deekonda, SRankin, DDavis, PLai, JPorreca, FHruby, VJ Design, synthesis and biological evaluation of multifunctional ligands targeting opioid and bradykinin 2 receptors. Bioorg Med Chem Lett25:4148-52 (2015) 
 
Delta-type opioid receptor
Name:Delta-type opioid receptor
Type:G Protein-Coupled Receptor (GPCR)
Mol. Mass.:40382.98
Organism:Homo sapiens (Human)
Description:Competition binding assays were carried out using membrane preparations from transfected HN9.10 cells that constitutively expressed the delta opioid receptor.
Residue:372
BDBM50121680
NameBDBM50121680
Synonyms:CHEMBL3616943
TypeSmall organic molecule
Emp. Form.C82H116N24O17S
Mol. Mass.1742.014
SMILESC[C@@H](NC(=O)[C@@H](N)Cc1ccc(O)cc1)C(=O)NCC(=O)N[C@@H](Cc1ccccc1)C(=O)NCC(NC(=O)C(Cc1cccs1)NC(=O)CNC(=O)C1CC(O)CN1C(=O)[C@@H]1CCCN1C(=O)[C@H](CCCNC(N)=N)NC(=O)[C@H](N)CCCNC(N)=N)C(=O)N1Cc2ccccc2C[C@@H]1C(=O)N1C2CCCCC2CC1C(=O)N[C@@H](CCCNC(N)=N)C(O)=O