Reaction Details
TargetDeath-associated protein kinase 1
LigandBDBM7459
Substrate/Competitorn/a
Meas. Tech.ChEMBL_1517176 (CHEMBL3620066)
IC50 21000±n/a nM
Citation Yokoyama, TKosaka, YMizuguchi, M Structural Insight into the Interactions between Death-Associated Protein Kinase 1 and Natural Flavonoids. J Med Chem58:7400-8 (2015) 
 
Death-associated protein kinase 1
Name:Death-associated protein kinase 1
Type:PROTEIN
Mol. Mass.:160053.35
Organism:Homo sapiens (Human)
Description:ChEMBL_1517177
Residue:1430
BDBM7459
NameBDBM7459
Synonyms:2-(3,4-dihydroxyphenyl)-5,7-dihydroxy-4H-chromen-4-one CHEMBL151 Luteolin (4) cid_5280445 med.21724, Compound 3
TypeSmall organic molecule
Emp. Form.C15H10O6
Mol. Mass.286.2363
SMILESOc1cc(O)c2c(c1)oc(cc2=O)-c1ccc(O)c(O)c1