Reaction Details
TargetDeath-associated protein kinase 1
LigandBDBM26655
Substrate/Competitorn/a
Meas. Tech.ChEMBL_1517176 (CHEMBL3620066)
IC50 87000±n/a nM
Citation Yokoyama, TKosaka, YMizuguchi, M Structural Insight into the Interactions between Death-Associated Protein Kinase 1 and Natural Flavonoids. J Med Chem58:7400-8 (2015) 
 
Death-associated protein kinase 1
Name:Death-associated protein kinase 1
Type:PROTEIN
Mol. Mass.:160053.35
Organism:Homo sapiens (Human)
Description:ChEMBL_1517177
Residue:1430
BDBM26655
NameBDBM26655
Synonyms:2-(3,4-dihydroxyphenyl)-3,5,7,8-tetrahydroxy-4H-chromen-4-one Gossypetin (23) | gossypetin
TypeFlavonoid
Emp. Form.C15H10O8
Mol. Mass.318.2351
SMILESOc1ccc(cc1O)-c1oc2c(O)c(O)cc(O)c2c(=O)c1O