Reaction Details
TargetCytoplasmic tyrosine-protein kinase BMX
LigandBDBM50123457
Substrate/Competitorn/a
Meas. Tech.ChEMBL_1521546 (CHEMBL3627424)
IC50 109±n/a nM
Citation Liu, QBatt, DGLippy, JSSurti, NTebben, AJMuckelbauer, JKChen, LAn, YChang, CPokross, MYang, ZWang, HBurke, JRCarter, PHTino, JA Design and synthesis of carbazole carboxamides as promising inhibitors of Bruton's tyrosine kinase (BTK) and Janus kinase 2 (JAK2). Bioorg Med Chem Lett25:4265-9 (2015) 
 
Cytoplasmic tyrosine-protein kinase BMX
Name:Cytoplasmic tyrosine-protein kinase BMX
Type:Tyrosine-protein kinase
Mol. Mass.:78030.42
Organism:Homo sapiens (Human)
Description:P51813
Residue:675
BDBM50123457
NameBDBM50123457
Synonyms:CHEMBL3622193
TypeSmall organic molecule
Emp. Form.C34H33FN6O3
Mol. Mass.592.6626
SMILESCN(C)c1ccc(cc1)C(=O)Nc1cccc(c1F)-c1ccc(C(N)=O)c2[nH]c3cc(ccc3c12)C(=O)N1CCN(C)CC1