Reaction Details
TargetCyclin-dependent kinase 2
LigandBDBM50123455
Substrate/Competitorn/a
Meas. Tech.ChEMBL_1521551 (CHEMBL3627429)
IC50 610±n/a nM
Citation Liu, QBatt, DGLippy, JSSurti, NTebben, AJMuckelbauer, JKChen, LAn, YChang, CPokross, MYang, ZWang, HBurke, JRCarter, PHTino, JA Design and synthesis of carbazole carboxamides as promising inhibitors of Bruton's tyrosine kinase (BTK) and Janus kinase 2 (JAK2). Bioorg Med Chem Lett25:4265-9 (2015) 
 
Cyclin-dependent kinase 2
Name:Cyclin-dependent kinase 2
Type:Enzyme Subunit
Mol. Mass.:33938.17
Organism:Homo sapiens (Human)
Description:P24941
Residue:298
BDBM50123455
NameBDBM50123455
Synonyms:CHEMBL3621496
TypeSmall organic molecule
Emp. Form.C25H23FN4O2
Mol. Mass.430.4741
SMILESCN1CCN(CC1)C(=O)c1ccc2c(c1)[nH]c1c(ccc(-c3ccccc3F)c21)C(N)=O