Reaction Details
TargetTyrosine-protein kinase Lck
LigandBDBM50123456
Substrate/Competitorn/a
Meas. Tech.ChEMBL_1521553 (CHEMBL3627431)
IC50 108±n/a nM
Citation Liu, QBatt, DGLippy, JSSurti, NTebben, AJMuckelbauer, JKChen, LAn, YChang, CPokross, MYang, ZWang, HBurke, JRCarter, PHTino, JA Design and synthesis of carbazole carboxamides as promising inhibitors of Bruton's tyrosine kinase (BTK) and Janus kinase 2 (JAK2). Bioorg Med Chem Lett25:4265-9 (2015) 
 
Tyrosine-protein kinase Lck
Name:Tyrosine-protein kinase Lck
Type:n/a
Mol. Mass.:57987.83
Organism:Homo sapiens (Human)
Description:P06239
Residue:509
BDBM50123456
NameBDBM50123456
Synonyms:CHEMBL3621515 US10676434, Example 107 | US11053197, Example 107
TypeSmall organic molecule
Emp. Form.C28H29N5O3
Mol. Mass.483.5616
SMILESCN1CCN(CC1)C(=O)c1ccc2c(c1)[nH]c1c(ccc(-c3cccc(NC(C)=O)c3C)c21)C(N)=O