Reaction Details
TargetNon-receptor tyrosine-protein kinase TYK2
LigandBDBM50123457
Substrate/Competitorn/a
Meas. Tech.ChEMBL_1521555 (CHEMBL3627433)
IC50 14300±n/a nM
Citation Liu, QBatt, DGLippy, JSSurti, NTebben, AJMuckelbauer, JKChen, LAn, YChang, CPokross, MYang, ZWang, HBurke, JRCarter, PHTino, JA Design and synthesis of carbazole carboxamides as promising inhibitors of Bruton's tyrosine kinase (BTK) and Janus kinase 2 (JAK2). Bioorg Med Chem Lett25:4265-9 (2015) 
 
Non-receptor tyrosine-protein kinase TYK2
Name:Non-receptor tyrosine-protein kinase TYK2
Type:Protein
Mol. Mass.:133666.03
Organism:Homo sapiens (Human)
Description:P29597
Residue:1187
BDBM50123457
NameBDBM50123457
Synonyms:CHEMBL3622193
TypeSmall organic molecule
Emp. Form.C34H33FN6O3
Mol. Mass.592.6626
SMILESCN(C)c1ccc(cc1)C(=O)Nc1cccc(c1F)-c1ccc(C(N)=O)c2[nH]c3cc(ccc3c12)C(=O)N1CCN(C)CC1