Reaction Details
TargetTyrosine-protein kinase BTK
LigandBDBM50123476
Substrate/Competitorn/a
Meas. Tech.ChEMBL_1521543 (CHEMBL3627421)
IC50 24±n/a nM
Citation Liu, QBatt, DGLippy, JSSurti, NTebben, AJMuckelbauer, JKChen, LAn, YChang, CPokross, MYang, ZWang, HBurke, JRCarter, PHTino, JA Design and synthesis of carbazole carboxamides as promising inhibitors of Bruton's tyrosine kinase (BTK) and Janus kinase 2 (JAK2). Bioorg Med Chem Lett25:4265-9 (2015) 
 
Tyrosine-protein kinase BTK
Name:Tyrosine-protein kinase BTK
Type:Enzyme
Mol. Mass.:76289.95
Organism:Homo sapiens (Human)
Description:Q06187
Residue:659
BDBM50123476
NameBDBM50123476
Synonyms:CHEMBL3621501
TypeSmall organic molecule
Emp. Form.C26H26N4O2
Mol. Mass.426.5102
SMILESCN1CCN(CC1)C(=O)c1ccc2c(c1)[nH]c1c(ccc(-c3ccccc3C)c21)C(N)=O