Reaction Details
TargetTyrosine-protein kinase BTK
LigandBDBM50123536
Substrate/Competitorn/a
Meas. Tech.ChEMBL_1521543 (CHEMBL3627421)
IC50 144±n/a nM
Citation Liu, QBatt, DGLippy, JSSurti, NTebben, AJMuckelbauer, JKChen, LAn, YChang, CPokross, MYang, ZWang, HBurke, JRCarter, PHTino, JA Design and synthesis of carbazole carboxamides as promising inhibitors of Bruton's tyrosine kinase (BTK) and Janus kinase 2 (JAK2). Bioorg Med Chem Lett25:4265-9 (2015) 
 
Tyrosine-protein kinase BTK
Name:Tyrosine-protein kinase BTK
Type:Enzyme
Mol. Mass.:76289.95
Organism:Homo sapiens (Human)
Description:Q06187
Residue:659
BDBM50123536
NameBDBM50123536
Synonyms:CHEMBL3621502
TypeSmall organic molecule
Emp. Form.C26H26N4O3
Mol. Mass.442.5096
SMILESCOc1ccccc1-c1ccc(C(N)=O)c2[nH]c3cc(ccc3c12)C(=O)N1CCN(C)CC1