Reaction Details
TargetTyrosine-protein kinase BTK
LigandBDBM50123540
Substrate/Competitorn/a
Meas. Tech.ChEMBL_1521543 (CHEMBL3627421)
IC50 59±n/a nM
Citation Liu, QBatt, DGLippy, JSSurti, NTebben, AJMuckelbauer, JKChen, LAn, YChang, CPokross, MYang, ZWang, HBurke, JRCarter, PHTino, JA Design and synthesis of carbazole carboxamides as promising inhibitors of Bruton's tyrosine kinase (BTK) and Janus kinase 2 (JAK2). Bioorg Med Chem Lett25:4265-9 (2015) 
 
Tyrosine-protein kinase BTK
Name:Tyrosine-protein kinase BTK
Type:Enzyme
Mol. Mass.:76289.95
Organism:Homo sapiens (Human)
Description:Q06187
Residue:659
BDBM50123540
NameBDBM50123540
Synonyms:CHEMBL3621506
TypeSmall organic molecule
Emp. Form.C25H23ClN4O2
Mol. Mass.446.929
SMILESCN1CCN(CC1)C(=O)c1ccc2c(c1)[nH]c1c(ccc(-c3ccc(Cl)cc3)c21)C(N)=O