Reaction Details
TargetTyrosine-protein kinase BTK
LigandBDBM130257
Substrate/Competitorn/a
Meas. Tech.ChEMBL_1521543 (CHEMBL3627421)
IC50 110±n/a nM
Citation Liu, QBatt, DGLippy, JSSurti, NTebben, AJMuckelbauer, JKChen, LAn, YChang, CPokross, MYang, ZWang, HBurke, JRCarter, PHTino, JA Design and synthesis of carbazole carboxamides as promising inhibitors of Bruton's tyrosine kinase (BTK) and Janus kinase 2 (JAK2). Bioorg Med Chem Lett25:4265-9 (2015) 
 
Tyrosine-protein kinase BTK
Name:Tyrosine-protein kinase BTK
Type:Enzyme
Mol. Mass.:76289.95
Organism:Homo sapiens (Human)
Description:Q06187
Residue:659
BDBM130257
NameBDBM130257
Synonyms:US8815840, 17
TypeSmall organic molecule
Emp. Form.C25H23ClN4O2
Mol. Mass.446.929
SMILESCN1CCN(CC1)C(=O)c1ccc2[nH]c3c(cc(cc3c2c1)-c1ccc(Cl)cc1)C(N)=O