Reaction Details
TargetHepatocyte growth factor receptor
LigandBDBM50123803
Substrate/Competitorn/a
Meas. Tech.ChEMBL_1519165 (CHEMBL3624358)
IC50>10000±n/a nM
Citation Lin, XDYang, HWMa, SLi, WWZhang, CHWang, WJXiang, RLi, LLYang, SY Discovery of 6-phenylimidazo[2,1-b]thiazole derivatives as a new type of FLT3 inhibitors. Bioorg Med Chem Lett25:4534-8 (2015) 
 
Hepatocyte growth factor receptor
Name:Hepatocyte growth factor receptor
Type:Protein
Mol. Mass.:155559.73
Organism:Homo sapiens (Human)
Description:P08581
Residue:1390
BDBM50123803
NameBDBM50123803
Synonyms:CHEMBL3623375
TypeSmall organic molecule
Emp. Form.C25H31N7O3S
Mol. Mass.509.624
SMILESCN(C)CCCNC(=O)c1csc2nc(cn12)-c1ccc(NC(=O)Nc2cc(on2)C(C)(C)C)cc1