Reaction Details
TargetLIM domain kinase 2
LigandBDBM50124354
Substrate/Competitorn/a
Meas. Tech.ChEMBL_1520364 (CHEMBL3624102)
IC50 1.000000±n/a nM
Citation Charles, MDBrookfield, JLEkwuru, TCStockley, MDunn, JRiddick, MHammonds, TTrivier, EGreenland, GWong, ACCheasty, ABoyd, SCrighton, DOlson, MF Discovery, Development, and SAR of Aminothiazoles as LIMK Inhibitors with Cellular Anti-Invasive Properties. J Med Chem58:8309-13 (2015) 
 
LIM domain kinase 2
Name:LIM domain kinase 2
Type:PROTEIN
Mol. Mass.:72238.81
Organism:Homo sapiens (Human)
Description:ChEMBL_1514398
Residue:638
BDBM50124354
NameBDBM50124354
Synonyms:CHEMBL3623439
TypeSmall organic molecule
Emp. Form.C20H14ClN3OS
Mol. Mass.379.863
SMILESOc1ccc(Nc2ncc(s2)-c2ccncc2-c2ccccc2Cl)cc1