Reaction Details
TargetLIM domain kinase 1
LigandBDBM50124400
Substrate/Competitorn/a
Meas. Tech.ChEMBL_1520362 (CHEMBL3624100)
IC50 3.0±n/a nM
Citation Charles, MDBrookfield, JLEkwuru, TCStockley, MDunn, JRiddick, MHammonds, TTrivier, EGreenland, GWong, ACCheasty, ABoyd, SCrighton, DOlson, MF Discovery, Development, and SAR of Aminothiazoles as LIMK Inhibitors with Cellular Anti-Invasive Properties. J Med Chem58:8309-13 (2015) 
 
LIM domain kinase 1
Name:LIM domain kinase 1
Type:Enzyme Catalytic Domain
Mol. Mass.:72591.81
Organism:Homo sapiens (Human)
Description:gi_4505001
Residue:647
BDBM50124400
NameBDBM50124400
Synonyms:CHEMBL3623438
TypeSmall organic molecule
Emp. Form.C20H14ClN3S
Mol. Mass.363.863
SMILESClc1ccccc1-c1cnccc1-c1cnc(Nc2ccccc2)s1