Reaction Details
TargetLIM domain kinase 1
LigandBDBM50124355
Substrate/Competitorn/a
Meas. Tech.ChEMBL_1520362 (CHEMBL3624100)
IC50 1.000000±n/a nM
Citation Charles, MDBrookfield, JLEkwuru, TCStockley, MDunn, JRiddick, MHammonds, TTrivier, EGreenland, GWong, ACCheasty, ABoyd, SCrighton, DOlson, MF Discovery, Development, and SAR of Aminothiazoles as LIMK Inhibitors with Cellular Anti-Invasive Properties. J Med Chem58:8309-13 (2015) 
 
LIM domain kinase 1
Name:LIM domain kinase 1
Type:Enzyme Catalytic Domain
Mol. Mass.:72591.81
Organism:Homo sapiens (Human)
Description:gi_4505001
Residue:647
BDBM50124355
NameBDBM50124355
Synonyms:CHEMBL3623442
TypeSmall organic molecule
Emp. Form.C19H18ClN3OS
Mol. Mass.371.884
SMILESCC(C)C(=O)Nc1ncc(s1)-c1ccncc1-c1ccc(C)cc1Cl