Reaction Details
TargetGrowth factor receptor-bound protein 7
LigandBDBM50124405
Substrate/Competitorn/a
Meas. Tech.ChEMBL_1520386 (CHEMBL3624249)
Kd 3900±n/a nM
Citation Watson, GMGunzburg, MJAmbaye, NDLucas, WATraore, DAKulkarni, KCergol, KMPayne, RJPanjikar, SPero, SCPerlmutter, PWilce, MCWilce, JA Cyclic Peptides Incorporating Phosphotyrosine Mimetics as Potent and Specific Inhibitors of the Grb7 Breast Cancer Target. J Med Chem58:7707-18 (2015) 
 
Growth factor receptor-bound protein 7
Name:Growth factor receptor-bound protein 7
Type:PROTEIN
Mol. Mass.:59700.56
Organism:Homo sapiens (Human)
Description:ChEMBL_699661
Residue:532
BDBM50124405
NameBDBM50124405
Synonyms:CHEMBL3623449
TypeSmall organic molecule
Emp. Form.C69H82N14O20S
Mol. Mass.1459.536
SMILES[H][C@@]12CCCN1C(=O)[C@H](Cc1ccccc1)NC(=O)[C@@]([H])(NC(=O)[C@H](CC(N)=O)NC(=O)[C@H](CC(O)=O)NC(=O)[C@H](Cc1ccc(CC(O)=O)cc1)NC(=O)CNC(=O)[C@H](CCC(O)=O)NC(=O)[C@H](Cc1ccccc1)NC(=O)[C@H](Cc1cc3ccccc3[nH]1)NC(=O)CSC[C@H](NC2=O)C(N)=O)[C@@H](C)O