Reaction Details
TargetDNA topoisomerase 2-alpha
LigandBDBM50125944
Substrate/Competitorn/a
Meas. Tech.ChEMBL_1522740 (CHEMBL3630081)
IC50 10000±n/a nM
Citation Chen, TCWu, CLLee, CCChen, CLYu, DSHuang, HS Structure-based hybridization, synthesis and biological evaluation of novel tetracyclic heterocyclic azathioxanthone analogues as potential antitumor agents. Eur J Med Chem103:615-27 (2015) 
 
DNA topoisomerase 2-alpha
Name:DNA topoisomerase 2-alpha
Type:Protein
Mol. Mass.:174415.30
Organism:Homo sapiens (Human)
Description:P11388
Residue:1531
BDBM50125944
NameBDBM50125944
Synonyms:CHEMBL3627832
TypeSmall organic molecule
Emp. Form.C20H16ClN3OS
Mol. Mass.381.879
SMILESClc1ccc2c(c1)sc1c(nc3ccccc3c1c2=O)N1CCNCC1