Reaction Details
TargetSphingosine kinase 2
LigandBDBM50393642
Substrate/Competitorn/a
Meas. Tech.ChEMBL_1522932 (CHEMBL3630964)
Ki 10000±n/a nM
Citation Congdon, MDChildress, ESPatwardhan, NNGumkowski, JMorris, EAKharel, YLynch, KRSantos, WL Structure-activity relationship studies of the lipophilic tail region of sphingosine kinase 2 inhibitors. Bioorg Med Chem Lett25:4956-60 (2015) 
 
Sphingosine kinase 2
Name:Sphingosine kinase 2
Type:Protein
Mol. Mass.:69221.44
Organism:Homo sapiens (Human)
Description:Q9NRA0
Residue:654
BDBM50393642
NameBDBM50393642
Synonyms:CHEMBL2158685
TypeSmall organic molecule
Emp. Form.C23H25ClN2O
Mol. Mass.380.91
SMILESClc1ccc(cc1)C12CC3CC(CC(C3)(C1)C(=O)NCc1ccncc1)C2