Reaction Details
TargetCystine/glutamate transporter
LigandBDBM50126157
Substrate/Competitorn/a
Meas. Tech.ChEMBL_1523603 (CHEMBL3631402)
IC50 300±n/a nM
Citation Larraufie, MHYang, WSJiang, EThomas, AGSlusher, BSStockwell, BR Incorporation of metabolically stable ketones into a small molecule probe to increase potency and water solubility. Bioorg Med Chem Lett25:4787-92 (2015) 
 
Cystine/glutamate transporter
Name:Cystine/glutamate transporter
Type:PROTEIN
Mol. Mass.:55437.48
Organism:Homo sapiens (Human)
Description:ChEMBL_772170
Residue:501
BDBM50126157
NameBDBM50126157
Synonyms:CHEMBL3629580
TypeSmall organic molecule
Emp. Form.C37H43ClN6O5
Mol. Mass.687.228
SMILESCC(C)Oc1ccc(cc1-n1c(CN2CCN(CC2)C(=O)COc2ccc(Cl)cc2)nc2ccccc2c1=O)C(=O)CN1CCN(C)CC1