Reaction Details
TargetCystine/glutamate transporter
LigandBDBM50126159
Substrate/Competitorn/a
Meas. Tech.ChEMBL_1523603 (CHEMBL3631402)
IC50 10.0±n/a nM
Citation Larraufie, MHYang, WSJiang, EThomas, AGSlusher, BSStockwell, BR Incorporation of metabolically stable ketones into a small molecule probe to increase potency and water solubility. Bioorg Med Chem Lett25:4787-92 (2015) 
 
Cystine/glutamate transporter
Name:Cystine/glutamate transporter
Type:PROTEIN
Mol. Mass.:55437.48
Organism:Homo sapiens (Human)
Description:ChEMBL_772170
Residue:501
BDBM50126159
NameBDBM50126159
Synonyms:CHEMBL3629668
TypeSmall organic molecule
Emp. Form.C39H45ClN6O5
Mol. Mass.713.265
SMILESCC(C)Oc1ccc(cc1-n1c(CN2CCN(CC2)C(=O)COc2ccc(Cl)cc2)nc2ccccc2c1=O)C(=O)CN1CCN(CC=C)CC1