Reaction Details
TargetCystine/glutamate transporter
LigandBDBM50126160
Substrate/Competitorn/a
Meas. Tech.ChEMBL_1523603 (CHEMBL3631402)
IC50 4.0±n/a nM
Citation Larraufie, MHYang, WSJiang, EThomas, AGSlusher, BSStockwell, BR Incorporation of metabolically stable ketones into a small molecule probe to increase potency and water solubility. Bioorg Med Chem Lett25:4787-92 (2015) 
 
Cystine/glutamate transporter
Name:Cystine/glutamate transporter
Type:PROTEIN
Mol. Mass.:55437.48
Organism:Homo sapiens (Human)
Description:ChEMBL_772170
Residue:501
BDBM50126160
NameBDBM50126160
Synonyms:CHEMBL3629669
TypeSmall organic molecule
Emp. Form.C44H49ClN6O6
Mol. Mass.793.349
SMILESCOc1ccc(CN2CCN(CC(=O)c3ccc(OC(C)C)c(c3)-n3c(CN4CCN(CC4)C(=O)COc4ccc(Cl)cc4)nc4ccccc4c3=O)CC2)cc1