Reaction Details
TargetInduced myeloid leukemia cell differentiation protein Mcl-1
LigandBDBM50067354
Substrate/Competitorn/a
Meas. Tech.ChEMBL_1522989 (CHEMBL3631165)
Ki 290±n/a nM
Citation Fu, HHou, XWang, LDun, YYang, XFang, H Design, synthesis and biological evaluation of 3-aryl-rhodanine benzoic acids as anti-apoptotic protein Bcl-2 inhibitors. Bioorg Med Chem Lett25:5265-9 (2015) 
 
Induced myeloid leukemia cell differentiation protein Mcl-1
Name:Induced myeloid leukemia cell differentiation protein Mcl-1
Type:Membrane; Single-pass membrane protein
Mol. Mass.:37332.87
Organism:Homo sapiens (Human)
Description:Q07820
Residue:350
BDBM50067354
NameBDBM50067354
Synonyms:CHEMBL3401826
TypeSmall organic molecule
Emp. Form.C32H26N2O4S3
Mol. Mass.598.755
SMILESCc1ccc(cc1)S(=O)(=O)NC(=O)[C@H](Cc1ccccc1)N1C(=S)S\C(=C/c2ccc(cc2)-c2ccccc2)C1=O