Reaction Details
TargetBeta-2 adrenergic receptor
LigandBDBM50343161
Substrate/Competitorn/a
Meas. Tech.ChEMBL_1522861 (CHEMBL3630579)
EC50 2.4±n/a nM
Citation Jones, LHBurrows, JFeeder, NGlossop, PJames, KJones, RMKenyon, ASPatel, SRoberts, DFSelby, MDStrang, RSStuart, EFTrevethick, MAWatson, JWright, KNClarke, N Molecular hybridization yields triazole bronchodilators for the treatment of COPD. Bioorg Med Chem Lett25:5121-6 (2015) 
 
Beta-2 adrenergic receptor
Name:Beta-2 adrenergic receptor
Type:n/a
Mol. Mass.:46461.69
Organism:Homo sapiens (Human)
Description:P07550
Residue:413
BDBM50343161
NameBDBM50343161
Synonyms:5-((R)-2-(4-(4-(3-((R)-3-(diisopropylamino)-1-phenylpropyl)-4-hydroxyphenyl)butoxy)phenethylamino)-1-hydroxyethyl)-8-hydroxyquinolin-2(1H)-one | CHEMBL1773267
TypeSmall organic molecule
Emp. Form.C44H55N3O5
Mol. Mass.705.9246
SMILESCC(C)N(CC[C@H](c1ccccc1)c1cc(CCCCOc2ccc(CCNC[C@H](O)c3ccc(O)c4[nH]c(=O)ccc34)cc2)ccc1O)C(C)C