Reaction Details
TargetMuscarinic acetylcholine receptor M3
LigandBDBM50128830
Substrate/Competitorn/a
Meas. Tech.ChEMBL_1522863 (CHEMBL3630581)
Ki 0.730000±n/a nM
Citation Jones, LHBurrows, JFeeder, NGlossop, PJames, KJones, RMKenyon, ASPatel, SRoberts, DFSelby, MDStrang, RSStuart, EFTrevethick, MAWatson, JWright, KNClarke, N Molecular hybridization yields triazole bronchodilators for the treatment of COPD. Bioorg Med Chem Lett25:5121-6 (2015) 
 
Muscarinic acetylcholine receptor M3
Name:Muscarinic acetylcholine receptor M3
Type:Enzyme
Mol. Mass.:66151.03
Organism:Homo sapiens (Human)
Description:P20309
Residue:590
BDBM50128830
NameBDBM50128830
Synonyms:CHEMBL3629353
TypeSmall organic molecule
Emp. Form.C38H47ClN4O6
Mol. Mass.691.256
SMILESO[C@@H](CNCCCCCCCCCN1CCC(CC1)OC(=O)Nc1ccccc1-c1ccc(O)c(Cl)c1)c1ccc(O)c2[nH]c(=O)ccc12