Reaction Details
TargetMuscarinic acetylcholine receptor M3
LigandBDBM50128833
Substrate/Competitorn/a
Meas. Tech.ChEMBL_1522863 (CHEMBL3630581)
Ki 7.7±n/a nM
Citation Jones, LHBurrows, JFeeder, NGlossop, PJames, KJones, RMKenyon, ASPatel, SRoberts, DFSelby, MDStrang, RSStuart, EFTrevethick, MAWatson, JWright, KNClarke, N Molecular hybridization yields triazole bronchodilators for the treatment of COPD. Bioorg Med Chem Lett25:5121-6 (2015) 
 
Muscarinic acetylcholine receptor M3
Name:Muscarinic acetylcholine receptor M3
Type:Enzyme
Mol. Mass.:66151.03
Organism:Homo sapiens (Human)
Description:P20309
Residue:590
BDBM50128833
NameBDBM50128833
Synonyms:CHEMBL3629358
TypeSmall organic molecule
Emp. Form.C41H58N6O4
Mol. Mass.698.937
SMILESO[C@@H](CNCCCCCCCCCN1CCC(Cn2cnc(n2)C(O)(C2CCCCC2)c2ccccc2)CC1)c1ccc(O)c2[nH]c(=O)ccc12