Reaction Details
TargetTransient receptor potential cation channel subfamily V member 1
LigandBDBM50128922
Substrate/Competitorn/a
Meas. Tech.ChEMBL_1522887 (CHEMBL3630760)
IC50 32±n/a nM
Citation Ann, JJung, AKim, MYKim, HMRyu, HKim, SKang, DWHong, SCui, MChoi, SBlumberg, PMFrank-Foltyn, RBahrenberg, GStockhausen, HChristoph, TLee, J Structure activity relationships of benzyl C-region analogs of 2-(3-fluoro-4-methylsulfonamidophenyl)propanamides as potent TRPV1 antagonists. Bioorg Med Chem23:6844-54 (2015) 
 
Transient receptor potential cation channel subfamily V member 1
Name:Transient receptor potential cation channel subfamily V member 1
Type:Protein
Mol. Mass.:94960.75
Organism:Homo sapiens (Human)
Description:Q8NER1
Residue:839
BDBM50128922
NameBDBM50128922
Synonyms:CHEMBL3627950
TypeSmall organic molecule
Emp. Form.C23H26F4N2O3S2
Mol. Mass.518.588
SMILESCC(C(=O)NCc1ccc(cc1SC1CCCC1)C(F)(F)F)c1ccc(NS(C)(=O)=O)c(F)c1