Reaction Details
TargetTransient receptor potential cation channel subfamily V member 1
LigandBDBM50129004
Substrate/Competitorn/a
Meas. Tech.ChEMBL_1522886 (CHEMBL3630759)
Ki 0.800000±n/a nM
Citation Ann, JJung, AKim, MYKim, HMRyu, HKim, SKang, DWHong, SCui, MChoi, SBlumberg, PMFrank-Foltyn, RBahrenberg, GStockhausen, HChristoph, TLee, J Structure activity relationships of benzyl C-region analogs of 2-(3-fluoro-4-methylsulfonamidophenyl)propanamides as potent TRPV1 antagonists. Bioorg Med Chem23:6844-54 (2015) 
 
Transient receptor potential cation channel subfamily V member 1
Name:Transient receptor potential cation channel subfamily V member 1
Type:Protein
Mol. Mass.:94960.75
Organism:Homo sapiens (Human)
Description:Q8NER1
Residue:839
BDBM50129004
NameBDBM50129004
Synonyms:CHEMBL3627938
TypeSmall organic molecule
Emp. Form.C25H33F3N2O4S
Mol. Mass.514.601
SMILESCCCCCCOc1cc(ccc1CNC(=O)C(C)c1ccc(NS(C)(=O)=O)c(F)c1)C(C)(F)F