Reaction Details
TargetTransient receptor potential cation channel subfamily V member 1
LigandBDBM50129018
Substrate/Competitorn/a
Meas. Tech.ChEMBL_1522886 (CHEMBL3630759)
Ki 0.500000±n/a nM
Citation Ann, JJung, AKim, MYKim, HMRyu, HKim, SKang, DWHong, SCui, MChoi, SBlumberg, PMFrank-Foltyn, RBahrenberg, GStockhausen, HChristoph, TLee, J Structure activity relationships of benzyl C-region analogs of 2-(3-fluoro-4-methylsulfonamidophenyl)propanamides as potent TRPV1 antagonists. Bioorg Med Chem23:6844-54 (2015) 
 
Transient receptor potential cation channel subfamily V member 1
Name:Transient receptor potential cation channel subfamily V member 1
Type:Protein
Mol. Mass.:94960.75
Organism:Homo sapiens (Human)
Description:Q8NER1
Residue:839
BDBM50129018
NameBDBM50129018
Synonyms:CHEMBL3627953
TypeSmall organic molecule
Emp. Form.C25H24F4N2O3S2
Mol. Mass.540.593
SMILESCC(C(=O)NCc1ccc(cc1SCc1ccccc1)C(F)(F)F)c1ccc(NS(C)(=O)=O)c(F)c1