Reaction Details
TargetTransient receptor potential cation channel subfamily V member 1
LigandBDBM50088041
Substrate/Competitorn/a
Meas. Tech.ChEMBL_1522886 (CHEMBL3630759)
Ki 0.900000±n/a nM
Citation Ann, JJung, AKim, MYKim, HMRyu, HKim, SKang, DWHong, SCui, MChoi, SBlumberg, PMFrank-Foltyn, RBahrenberg, GStockhausen, HChristoph, TLee, J Structure activity relationships of benzyl C-region analogs of 2-(3-fluoro-4-methylsulfonamidophenyl)propanamides as potent TRPV1 antagonists. Bioorg Med Chem23:6844-54 (2015) 
 
Transient receptor potential cation channel subfamily V member 1
Name:Transient receptor potential cation channel subfamily V member 1
Type:Protein
Mol. Mass.:94960.75
Organism:Homo sapiens (Human)
Description:Q8NER1
Residue:839
BDBM50088041
NameBDBM50088041
Synonyms:CHEMBL2442911
TypeSmall organic molecule
Emp. Form.C23H27F4N3O3S2
Mol. Mass.533.602
SMILESCC(C(=O)NCc1ccc(nc1SC1CCCCC1)C(F)(F)F)c1ccc(NS(C)(=O)=O)c(F)c1