Reaction Details
TargetMitogen-activated protein kinase kinase kinase 7
LigandBDBM50129083
Substrate/Competitorn/a
Meas. Tech.ChEMBL_1523179 (CHEMBL3632095)
IC50>30000±n/a nM
Citation Fakhouri, LEl-Elimat, THurst, DPReggio, PHPearce, CJOberlies, NHCroatt, MP Isolation, semisynthesis, covalent docking and transforming growth factor beta-activated kinase 1 (TAK1)-inhibitory activities of (5Z)-7-oxozeaenol analogues. Bioorg Med Chem23:6993-9 (2015) 
 
Mitogen-activated protein kinase kinase kinase 7
Name:Mitogen-activated protein kinase kinase kinase 7
Type:Protein
Mol. Mass.:67199.89
Organism:Homo sapiens (Human)
Description:O43318
Residue:606
BDBM50129083
NameBDBM50129083
Synonyms:CHEMBL3628303
TypeSmall organic molecule
Emp. Form.C19H24O7
Mol. Mass.364.3897
SMILES[H][C@]12C\C=C\C3=CC(OC)=CC(O)C3C(=O)O[C@@H](C)CC(CC(=O)[C@H]1O)O2