Reaction Details
TargetMitogen-activated protein kinase kinase kinase 7
LigandBDBM50129130
Substrate/Competitorn/a
Meas. Tech.ChEMBL_1523179 (CHEMBL3632095)
IC50 77±n/a nM
Citation Fakhouri, LEl-Elimat, THurst, DPReggio, PHPearce, CJOberlies, NHCroatt, MP Isolation, semisynthesis, covalent docking and transforming growth factor beta-activated kinase 1 (TAK1)-inhibitory activities of (5Z)-7-oxozeaenol analogues. Bioorg Med Chem23:6993-9 (2015) 
 
Mitogen-activated protein kinase kinase kinase 7
Name:Mitogen-activated protein kinase kinase kinase 7
Type:Protein
Mol. Mass.:67199.89
Organism:Homo sapiens (Human)
Description:O43318
Residue:606
BDBM50129130
NameBDBM50129130
Synonyms:CHEMBL3629241
TypeSmall organic molecule
Emp. Form.C19H22F2O7
Mol. Mass.400.3706
SMILESCOC1=CC(O)C2=C(\C=C\C[C@H](O)[C@H](O)C(=O)\C=C/C[C@H](C)OC2=O)C1(F)F