Reaction Details
TargetCarbonic anhydrase 2
LigandBDBM50241244
Substrate/Competitorn/a
Meas. Tech.ChEBML_1523541
Temperature298.15±n/a K
Ki>10000±n/a nM
Commentsextracted
Citation Karioti, ACeruso, MCarta, FBilia, ARSupuran, CT New natural product carbonic anhydrase inhibitors incorporating phenol moieties. Bioorg Med Chem23:7219-25 (2015) 
 
Carbonic anhydrase 2
Name:Carbonic anhydrase 2
Type:Enzyme
Mol. Mass.:29250.71
Organism:Homo sapiens (Human)
Description:P00918
Residue:260
BDBM50241244
NameBDBM50241244
Synonyms:(E)-((2R,3S,4S,5R,6S)-6-(5,7-dihydroxy-2-(4-hydroxyphenyl)-4-oxo-4H-chromen-3-yloxy)-3,4,5-trihydroxy-tetrahydro-2H-pyran-2-yl)methyl 3-(4-hydroxyphenyl)acrylate CHEMBL499705 kaempferol 3-O-(6'' ''-O-E-p-coumaroyl)-beta-D-glucopyranoside trans-Tiliroside
TypeSmall organic molecule
Emp. Form.C30H26O13
Mol. Mass.594.5196
SMILESO[C@@H]1[C@@H](COC(=O)C=Cc2ccc(O)cc2)O[C@@H](Oc2c(O)c3c(cc(O)cc3=O)oc2-c2ccc(O)cc2)[C@H](O)[C@H]1O