Reaction Details
TargetKelch-like ECH-associated protein 1
LigandBDBM50120422
Substrate/Competitorn/a
Meas. Tech.ChEMBL_1525531 (CHEMBL3637038)
IC50 110±n/a nM
Citation Jain, ADPotteti, HRichardson, BGKingsley, LLuciano, JPRyuzoji, AFLee, HKrunic, AMesecar, ADReddy, SPMoore, TW Probing the structural requirements of non-electrophilic naphthalene-based Nrf2 activators. Eur J Med Chem103:252-68 (2015) 
 
Kelch-like ECH-associated protein 1
Name:Kelch-like ECH-associated protein 1
Type:PROTEIN
Mol. Mass.:69664.53
Organism:Homo sapiens (Human)
Description:ChEMBL_107924
Residue:624
BDBM50120422
NameBDBM50120422
Synonyms:CHEMBL3617852
TypeSmall organic molecule
Emp. Form.C26H24N2O8S2
Mol. Mass.556.607
SMILESCOc1ccc(cc1)S(=O)(=O)Nc1ccc(N(CC(O)=O)S(=O)(=O)c2ccc(OC)cc2)c2ccccc12