Reaction Details
TargetKelch-like ECH-associated protein 1
LigandBDBM50130558
Substrate/Competitorn/a
Meas. Tech.ChEMBL_1525535 (CHEMBL3637042)
Kd 25±n/a nM
Citation Jain, ADPotteti, HRichardson, BGKingsley, LLuciano, JPRyuzoji, AFLee, HKrunic, AMesecar, ADReddy, SPMoore, TW Probing the structural requirements of non-electrophilic naphthalene-based Nrf2 activators. Eur J Med Chem103:252-68 (2015) 
 
Kelch-like ECH-associated protein 1
Name:Kelch-like ECH-associated protein 1
Type:PROTEIN
Mol. Mass.:69664.53
Organism:Homo sapiens (Human)
Description:ChEMBL_107924
Residue:624
BDBM50130558
NameBDBM50130558
Synonyms:CHEMBL3632891
TypeSmall organic molecule
Emp. Form.C67H79N11O22S
Mol. Mass.1422.47
SMILESCC(C)C[C@H](NC(=O)[C@H](Cc1ccccc1)NC(=O)[C@H](CCC(O)=O)NC(=O)CNC(=O)[C@@H](NC(=O)[C@H](CCC(O)=O)NC(=O)[C@H](CCC(O)=O)NC(=O)[C@H](CC(O)=O)NC(=O)[C@H](CC(C)C)NC(=O)c1cc(ccc1-c1c2ccc(O)cc2oc2cc(=O)ccc12)N=C=S)[C@@H](C)O)C(N)=O