Reaction Details
TargetInterleukin-1 receptor-associated kinase 4
LigandBDBM50095475
Substrate/Competitorn/a
Meas. Tech.ChEMBL_1526987 (CHEMBL3637447)
IC50 4.0±n/a nM
Citation Lim, JAltman, MDBaker, JBrubaker, JDChen, HChen, YKleinschek, MALi, CLiu, DMaclean, JKMulrooney, EFPresland, JRakhilina, LSmith, GFYang, R Identification of N-(1H-pyrazol-4-yl)carboxamide inhibitors of interleukin-1 receptor associated kinase 4: Bicyclic core modifications. Bioorg Med Chem Lett25:5384-8 (2015) 
 
Interleukin-1 receptor-associated kinase 4
Name:Interleukin-1 receptor-associated kinase 4
Type:Protein
Mol. Mass.:51519.08
Organism:Homo sapiens (Human)
Description:Q9NWZ3
Residue:460
BDBM50095475
NameBDBM50095475
Synonyms:CHEMBL3590479
TypeSmall organic molecule
Emp. Form.C18H22F2N8O
Mol. Mass.404.4171
SMILESCn1cc(NC(=O)c2cnn3ccc(N[C@@H]4CCCC[C@@H]4N)nc23)c(n1)C(F)F