Reaction Details
TargetSerine/threonine-protein kinase pim-2
LigandBDBM50131378
Substrate/Competitorn/a
Meas. Tech.ChEBML_1526829
Ki 0.300000±n/a nM
Citation Hu, HWang, XChan, GKChang, JHDo, SDrummond, JEbens, ALee, WLy, JLyssikatos, JPMurray, JMoffat, JGChao, QTsui, VWallweber, HKolesnikov, A Discovery of 3,5-substituted 6-azaindazoles as potent pan-Pim inhibitors. Bioorg Med Chem Lett25:5258-64 (2015) 
 
Serine/threonine-protein kinase pim-2
Name:Serine/threonine-protein kinase pim-2
Type:Serine/threonine-protein kinase
Mol. Mass.:34185.93
Organism:Homo sapiens (Human)
Description:Q9P1W9
Residue:311
BDBM50131378
NameBDBM50131378
Synonyms:CHEMBL3634782 | US9260425, 384
TypeSmall organic molecule
Emp. Form.C21H21N7
Mol. Mass.371.4383
SMILESCc1cncc(c1)-c1cc2c(n[nH]c2cn1)-c1cccc(n1)N1CCNCC1