Reaction Details
TargetSerine/threonine-protein kinase pim-3
LigandBDBM50131375
Substrate/Competitorn/a
Meas. Tech.ChEBML_1526830
Ki 0.100000±n/a nM
Citation Hu, HWang, XChan, GKChang, JHDo, SDrummond, JEbens, ALee, WLy, JLyssikatos, JPMurray, JMoffat, JGChao, QTsui, VWallweber, HKolesnikov, A Discovery of 3,5-substituted 6-azaindazoles as potent pan-Pim inhibitors. Bioorg Med Chem Lett25:5258-64 (2015) 
 
Serine/threonine-protein kinase pim-3
Name:Serine/threonine-protein kinase pim-3
Type:Protein
Mol. Mass.:35888.19
Organism:Homo sapiens (Human)
Description:Q86V86
Residue:326
BDBM50131375
NameBDBM50131375
Synonyms:CHEMBL3634779 | US9260425, 147
TypeSmall organic molecule
Emp. Form.C21H20FN7
Mol. Mass.389.4288
SMILESNC1CCN(CC1)c1cncc(n1)-c1cc2c(n[nH]c2cn1)-c1ccccc1F