Reaction Details
TargetTranslocator protein
LigandBDBM50327238
Substrate/Competitorn/a
Meas. Tech.ChEMBL_1526857 (CHEMBL3636925)
Ki 6.7±n/a nM
Citation Narlawar, RWerry, ELScarf, AMHanani, RChua, SWKing, VABarron, MLMartins, RNIttner, LMRendina, LMKassiou, M First Demonstration of Positive Allosteric-like Modulation at the Human Wild Type Translocator Protein (TSPO). J Med Chem58:8743-9 (2015) 
 
Translocator protein
Name:Translocator protein
Type:Enzyme
Mol. Mass.:18834.74
Organism:Homo sapiens (Human)
Description:P30536
Residue:169
BDBM50327238
NameBDBM50327238
Synonyms:2-[2-(4'-Methoxyphenyl)-5,7-dimethylpyrazolo[1,5-a]pyrimidin-3-yl]-N,N-diethylacetamide N,N-diethyl-2-(2-(4-methoxyphenyl)-5,7-dimethylpyrazolo[1,5-a]pyrimidin-3-yl)acetamide
TypeSmall organic molecule
Emp. Form.C21H26N4O2
Mol. Mass.366.4567
SMILESCCN(CC)C(=O)Cc1c(nn2c(C)cc(C)nc12)-c1ccc(OC)cc1