Reaction Details
TargetTyrosine-protein kinase Lck
LigandBDBM31088
Substrate/Competitorn/a
Meas. Tech.ChEMBL_1526220 (CHEMBL3636905)
IC50>6000±n/a nM
Citation Williams, TESubramanian, SVerhagen, JMcBride, CMCostales, ASung, LAntonios-McCrea, WMcKenna, MLouie, AKRamurthy, SLevine, BShafer, CMMachajewski, TRenhowe, PAAppleton, BAAmiri, PChou, JStuart, DAardalen, KPoon, D Discovery of RAF265: A Potent mut-B-RAF Inhibitor for the Treatment of Metastatic Melanoma. ACS Med Chem Lett6:961-5 (2015) 
 
Tyrosine-protein kinase Lck
Name:Tyrosine-protein kinase Lck
Type:n/a
Mol. Mass.:57987.83
Organism:Homo sapiens (Human)
Description:P06239
Residue:509
BDBM31088
NameBDBM31088
Synonyms:1-methyl-5-[2-[5-(trifluoromethyl)-1H-imidazol-2-yl]pyridin-4-yl]oxy-N-[4-(trifluoromethyl)phenyl]benzimidazol-2-amine CHIR-265 cid_11656518
TypeSmall organic molecule
Emp. Form.C24H16F6N6O
Mol. Mass.518.4139
SMILESCn1c(Nc2ccc(cc2)C(F)(F)F)nc2cc(Oc3ccnc(c3)-c3ncc([nH]3)C(F)(F)F)ccc12