Reaction Details
TargetMast/stem cell growth factor receptor Kit
LigandBDBM50131822
Substrate/Competitorn/a
Meas. Tech.ChEMBL_1526218 (CHEMBL3636903)
IC50 20±n/a nM
Citation Williams, TESubramanian, SVerhagen, JMcBride, CMCostales, ASung, LAntonios-McCrea, WMcKenna, MLouie, AKRamurthy, SLevine, BShafer, CMMachajewski, TRenhowe, PAAppleton, BAAmiri, PChou, JStuart, DAardalen, KPoon, D Discovery of RAF265: A Potent mut-B-RAF Inhibitor for the Treatment of Metastatic Melanoma. ACS Med Chem Lett6:961-5 (2015) 
 
Mast/stem cell growth factor receptor Kit
Name:Mast/stem cell growth factor receptor Kit
Type:Protein
Mol. Mass.:109869.37
Organism:Homo sapiens (Human)
Description:P10721
Residue:976
BDBM50131822
NameBDBM50131822
Synonyms:CHEMBL3632719
TypeSmall organic molecule
Emp. Form.C27H25F3N6O
Mol. Mass.506.5222
SMILESCn1c(Nc2cccc(c2)C(C)(C)C)nc2cc(Oc3ccnc(c3)-c3ncc([nH]3)C(F)(F)F)ccc12