Reaction Details
Target5-hydroxytryptamine receptor 2C
LigandBDBM50132341
Substrate/Competitorn/a
Meas. Tech.ChEMBL_1527393 (CHEMBL3636768)
Ki<300±n/a nM
Citation Ponnala, SKapadia, NMadapa, SAlberts, ILHarding, WW Synthesis and evaluation of aporphine analogs containing C1 allyl isosteres at the h5-HT(2A) receptor. Bioorg Med Chem Lett25:5102-6 (2015) 
 
5-hydroxytryptamine receptor 2C
Name:5-hydroxytryptamine receptor 2C
Type:G Protein-Coupled Receptor (GPCR)
Mol. Mass.:51836.79
Organism:Homo sapiens (Human)
Description:P28335
Residue:458
BDBM50132341
NameBDBM50132341
Synonyms:CHEMBL3633757
TypeSmall organic molecule
Emp. Form.C26H24BrNO4
Mol. Mass.494.377
SMILESCOc1cc2CCN(C)C3Cc4cc5OCOc5cc4-c(c1OCc1ccc(Br)cc1)c23