Reaction Details
TargetMucosa-associated lymphoid tissue lymphoma translocation protein 1
LigandBDBM50133337
Substrate/Competitorn/a
Meas. Tech.ChEMBL_1525779 (CHEMBL3635348)
IC50 4100±n/a nM
Citation Lim, SMJeong, YLee, SIm, HTae, HSKim, BGPark, HDPark, JHong, S Identification of฿-Lapachone Analogs as Novel MALT1 Inhibitors To Treat an Aggressive Subtype of Diffuse Large B-Cell Lymphoma. J Med Chem58:8491-502 (2015) 
 
Mucosa-associated lymphoid tissue lymphoma translocation protein 1
Name:Mucosa-associated lymphoid tissue lymphoma translocation protein 1
Type:Enzyme
Mol. Mass.:92257.81
Organism:Homo sapiens (Human)
Description:Q9UDY8
Residue:824
BDBM50133337
NameBDBM50133337
Synonyms:CHEMBL3632799
TypeSmall organic molecule
Emp. Form.C16H16N2O3
Mol. Mass.284.3098
SMILESO=C(CNC1=CC(=O)C(=O)c2ccccc12)N1CCCC1