Reaction Details
TargetCarbonic anhydrase 2
LigandBDBM26193
Substrate/Competitorn/a
Meas. Tech.ChEMBL_1526374 (CHEMBL3637535)
Ki 7100±n/a nM
Citation Isik, SVullo, DDurdagi, SEkinci, DSentürk, MÇetin, ASentürk, ESupuran, CT Interaction of carbonic anhydrase isozymes I, II, and IX with some pyridine and phenol hydrazinecarbothioamide derivatives. Bioorg Med Chem Lett25:5636-41 (2015) 
 
Carbonic anhydrase 2
Name:Carbonic anhydrase 2
Type:Enzyme
Mol. Mass.:29250.71
Organism:Homo sapiens (Human)
Description:P00918
Residue:260
BDBM26193
NameBDBM26193
Synonyms:2-Hydroxybenzoate, I CHEMBL424 salicylic acid
TypeSmall organic molecule
Emp. Form.C7H6O3
Mol. Mass.138.1207
SMILESOC(=O)c1ccccc1O