Reaction Details
TargetCarbonic anhydrase 2
LigandBDBM26187
Substrate/Competitorn/a
Meas. Tech.ChEMBL_1526374 (CHEMBL3637535)
Ki 5500±n/a nM
Citation Isik, SVullo, DDurdagi, SEkinci, DSentürk, MÇetin, ASentürk, ESupuran, CT Interaction of carbonic anhydrase isozymes I, II, and IX with some pyridine and phenol hydrazinecarbothioamide derivatives. Bioorg Med Chem Lett25:5636-41 (2015) 
 
Carbonic anhydrase 2
Name:Carbonic anhydrase 2
Type:Enzyme
Mol. Mass.:29250.71
Organism:Homo sapiens (Human)
Description:P00918
Residue:260
BDBM26187
NameBDBM26187
Synonyms:α-CA inhibitor, 11 US9688816, 2 | phenol
TypeSmall organic molecule
Emp. Form.C6H6O
Mol. Mass.94.1112
SMILESOc1ccccc1