Reaction Details
TargetCarbonic anhydrase 2
LigandBDBM50133805
Substrate/Competitorn/a
Meas. Tech.ChEMBL_1526374 (CHEMBL3637535)
Ki>10000±n/a nM
Citation Isik, SVullo, DDurdagi, SEkinci, DSentürk, MÇetin, ASentürk, ESupuran, CT Interaction of carbonic anhydrase isozymes I, II, and IX with some pyridine and phenol hydrazinecarbothioamide derivatives. Bioorg Med Chem Lett25:5636-41 (2015) 
 
Carbonic anhydrase 2
Name:Carbonic anhydrase 2
Type:Enzyme
Mol. Mass.:29250.71
Organism:Homo sapiens (Human)
Description:P00918
Residue:260
BDBM50133805
NameBDBM50133805
Synonyms:CHEMBL3633781
TypeSmall organic molecule
Emp. Form.C15H15N3O2S
Mol. Mass.301.364
SMILESCc1ccc(NC(=S)NNC(=O)c2ccccc2O)cc1